Reaction Details
TargetCocaine esterase
LigandBDBM22722
Substrate/Competitorn/a
Meas. Tech.ChEMBL_464394 (CHEMBL930043)
IC50 44±n/a nM
Citation Wheelock, CENishi, KYing, AJones, PDColvin, MEOlmstead, MMHammock, BD Influence of sulfur oxidation state and steric bulk upon trifluoromethyl ketone (TFK) binding kinetics to carboxylesterases and fatty acid amide hydrolase (FAAH). Bioorg Med Chem16:2114-30 (2008) 
 
Cocaine esterase
Name:Cocaine esterase
Type:PROTEIN
Mol. Mass.:61801.08
Organism:Homo sapiens (Human)
Description:ChEMBL_1494240
Residue:559
BDBM22722
NameBDBM22722
Synonyms:1,2-diphenylethane-1,2-dione CHEMBL189886 | Diphenylethane-1,2-dione
TypeSmall organic molecule
Emp. Form.C14H10O2
Mol. Mass.210.228
SMILESO=C(C(=O)c1ccccc1)c1ccccc1