Reaction Details
TargetCocaine esterase
LigandBDBM50371959
Substrate/Competitorn/a
Meas. Tech.ChEMBL_464384 (CHEMBL930033)
IC50 20±n/a nM
Citation Wheelock, CENishi, KYing, AJones, PDColvin, MEOlmstead, MMHammock, BD Influence of sulfur oxidation state and steric bulk upon trifluoromethyl ketone (TFK) binding kinetics to carboxylesterases and fatty acid amide hydrolase (FAAH). Bioorg Med Chem16:2114-30 (2008) 
 
Cocaine esterase
Name:Cocaine esterase
Type:PROTEIN
Mol. Mass.:61801.08
Organism:Homo sapiens (Human)
Description:ChEMBL_1494240
Residue:559
BDBM50371959
NameBDBM50371959
Synonyms:CHEMBL86668
TypeSmall organic molecule
Emp. Form.C12H21F3O
Mol. Mass.238.2897
SMILESCCCCCCCCCCC(=O)C(F)(F)F