Reaction Details
Target5-hydroxytryptamine receptor 5A
LigandBDBM50371985
Substrate/Competitorn/a
Meas. Tech.ChEMBL_464404 (CHEMBL930054)
Ki 10.1±n/a nM
Citation Peters, JULübbers, TAlanine, AKolczewski, SBlasco, FSteward, L Cyclic guanidines as dual 5-HT5A/5-HT7 receptor ligands: optimising brain penetration. Bioorg Med Chem Lett18:262-6 (2008) 
 
5-hydroxytryptamine receptor 5A
Name:5-hydroxytryptamine receptor 5A
Type:Enzyme
Mol. Mass.:40266.25
Organism:Homo sapiens (Human)
Description:P47898
Residue:357
BDBM50371985
NameBDBM50371985
Synonyms:CHEMBL404511
TypeSmall organic molecule
Emp. Form.C11H12ClF2N3
Mol. Mass.259.683
SMILESCC1NC(NCC(F)F)=Nc2cccc(Cl)c12