Reaction Details
TargetHistamine H1 receptor
LigandBDBM50371974
Substrate/Competitorn/a
Meas. Tech.ChEMBL_464412 (CHEMBL931079)
Ki 18.3±n/a nM
Citation Peters, JULübbers, TAlanine, AKolczewski, SBlasco, FSteward, L Cyclic guanidines as dual 5-HT5A/5-HT7 receptor ligands: optimising brain penetration. Bioorg Med Chem Lett18:262-6 (2008) 
 
Histamine H1 receptor
Name:Histamine H1 receptor
Type:G Protein-Coupled Receptor (GPCR)
Mol. Mass.:55808.72
Organism:Homo sapiens (Human)
Description:Cell pellets from SK-N-MC cells transfected with human H1 receptor were used in binding assay.
Residue:487
BDBM50371974
NameBDBM50371974
Synonyms:CHEMBL256047
TypeSmall organic molecule
Emp. Form.C11H11Cl2F2N3
Mol. Mass.294.128
SMILESC[C@H]1NC(NCC(F)F)=Nc2ccc(Cl)c(Cl)c12