Reaction Details
Target5-hydroxytryptamine receptor 7
LigandBDBM50371998
Substrate/Competitorn/a
Meas. Tech.ChEMBL_464406 (CHEMBL930056)
Ki 6±n/a nM
Citation Peters, JULübbers, TAlanine, AKolczewski, SBlasco, FSteward, L Cyclic guanidines as dual 5-HT5A/5-HT7 receptor ligands: optimising brain penetration. Bioorg Med Chem Lett18:262-6 (2008) 
 
5-hydroxytryptamine receptor 7
Name:5-hydroxytryptamine receptor 7
Type:G Protein-Coupled Receptor (GPCR)
Mol. Mass.:53573.08
Organism:Homo sapiens (Human)
Description:P34969
Residue:479
BDBM50371998
NameBDBM50371998
Synonyms:CHEMBL404372
TypeSmall organic molecule
Emp. Form.C9H10ClN3
Mol. Mass.195.649
SMILESC[C@@H]1NC(N)=Nc2cccc(Cl)c12