Reaction Details
TargetC-X-C chemokine receptor type 3
LigandBDBM50372009
Substrate/Competitorn/a
Meas. Tech.ChEMBL_464453 (CHEMBL948053)
Ki 20±n/a nM
Citation Knight, RLAllen, DRBirch, HLChapman, GAGalvin, FCJopling, LALock, CJMeissner, JWOwen, DARaphy, GWatson, RJWilliams, SC Development of CXCR3 antagonists. Part 4: discovery of 2-amino-(4-tropinyl)quinolines. Bioorg Med Chem Lett18:629-33 (2008) 
 
C-X-C chemokine receptor type 3
Name:C-X-C chemokine receptor type 3
Type:Enzyme Catalytic Domain
Mol. Mass.:40665.65
Organism:Homo sapiens (Human)
Description:n/a
Residue:368
BDBM50372009
NameBDBM50372009
Synonyms:CHEMBL271636
TypeSmall organic molecule
Emp. Form.C26H33FN4O2
Mol. Mass.452.5642
SMILESCOc1cc(F)c2ccc(NC3CCN(CC4=CC5CCCC(C4)N5C(C)=O)CC3)nc2c1