Reaction Details
TargetAurora kinase B
LigandBDBM12985
Substrate/Competitorn/a
Meas. Tech.ChEMBL_464495 (CHEMBL931997)
Ki 79±n/a nM
Citation Coumar, MSWu, JSLeou, JSTan, UKChang, CYChang, TYLin, WHHsu, JTChao, YSWu, SYHsieh, HP Aurora kinase A inhibitors: identification, SAR exploration and molecular modeling of 6,7-dihydro-4H-pyrazolo-[1,5-a]pyrrolo[3,4-d]pyrimidine-5,8-dione scaffold. Bioorg Med Chem Lett18:1623-7 (2008) 
 
Aurora kinase B
Name:Aurora kinase B
Type:Protein
Mol. Mass.:39327.72
Organism:Homo sapiens (Human)
Description:Q96GD4
Residue:344
BDBM12985
NameBDBM12985
Synonyms:5-Amido-pyrrolopyrazole 9d N-{5-[(2R)-2-methoxy-2-phenylacetyl]-1H,4H,5H,6H-pyrrolo[3,4-c]pyrazol-3-yl}-4-(4-methylpiperazin-1-yl)benzamide
TypeSmall organic molecule
Emp. Form.C26H30N6O3
Mol. Mass.474.5548
SMILESCO[C@@H](C(=O)N1Cc2n[nH]c(NC(=O)c3ccc(cc3)N3CCN(C)CC3)c2C1)c1ccccc1