Reaction Details
TargetAdenosine receptor A2a
LigandBDBM50372029
Substrate/Competitorn/a
Meas. Tech.ChEMBL_464500 (CHEMBL931999)
IC50 33±n/a nM
Citation Mantell, SJStephenson, PTMonaghan, SMMaw, GNTrevethick, MAYeadon, MKeir, RFWalker, DKJones, RMSelby, MDBatchelor, DVRozze, SChavaroche, HHobson, TJDodd, PGLemaitre, AWright, KNStuart, EF Inhaled adenosine A(2A) receptor agonists for the treatment of chronic obstructive pulmonary disease. Bioorg Med Chem Lett18:1284-7 (2008) 
 
Adenosine receptor A2a
Name:Adenosine receptor A2a
Type:G Protein-Coupled Receptor (GPCR)
Mol. Mass.:44716.46
Organism:Homo sapiens (Human)
Description:P29274
Residue:412
BDBM50372029
NameBDBM50372029
Synonyms:CHEMBL256489
TypeSmall organic molecule
Emp. Form.C40H55N9O5
Mol. Mass.741.922
SMILESCCNC(=O)[C@H]1O[C@H]([C@H](O)[C@@H]1O)n1cnc2c(NCC(c3ccccc3)c3ccccc3)nc(CNC(=O)NCCN(C3CCCCC3)C(C)(C)C)nc12