Reaction Details
TargetProthrombin
LigandBDBM50372046
Substrate/Competitorn/a
Meas. Tech.ChEMBL_464664 (CHEMBL933925)
Ki 0.36±n/a nM
Citation Isaacs, RCSolinsky, MGCutrona, KJNewton, CLNaylor-Olsen, AMMcMasters, DRKrueger, JALewis, SDLucas, BJKuo, LCYan, YLynch, JJLyle, EA Structure-based design of novel groups for use in the P1 position of thrombin inhibitor scaffolds. Part 2: N-acetamidoimidazoles. Bioorg Med Chem Lett18:2062-6 (2008) 
 
Prothrombin
Name:Prothrombin
Type:Protein
Mol. Mass.:70029.57
Organism:Homo sapiens (Human)
Description:P00734
Residue:622
BDBM50372046
NameBDBM50372046
Synonyms:CHEMBL401682
TypeSmall organic molecule
Emp. Form.C24H31N5O4S
Mol. Mass.485.599
SMILESCc1ncn(CC(=O)NC(C)(C)C)c1Cn1c(C)ccc(NS(=O)(=O)Cc2ccccc2)c1=O