Reaction Details
TargetProstaglandin E2 receptor EP4 subtype
LigandBDBM50372061
Substrate/Competitorn/a
Meas. Tech.ChEMBL_464678 (CHEMBL934070)
Ki 0.55±n/a nM
Citation Burch, JDBelley, MFortin, RDeschênes, DGirard, MColucci, JFarand, JTherien, AGMathieu, MCDenis, DVigneault, ELévesque, JFGagné, SWrona, MXu, DClark, PRowland, SHan, Y Structure-activity relationships and pharmacokinetic parameters of quinoline acylsulfonamides as potent and selective antagonists of the EP(4) receptor. Bioorg Med Chem Lett18:2048-54 (2008) 
 
Prostaglandin E2 receptor EP4 subtype
Name:Prostaglandin E2 receptor EP4 subtype
Type:Enzyme
Mol. Mass.:53134.53
Organism:Homo sapiens (Human)
Description:P35408
Residue:488
BDBM50372061
NameBDBM50372061
Synonyms:CHEMBL256822
TypeSmall organic molecule
Emp. Form.C34H35N3O7S
Mol. Mass.629.723
SMILESCCOc1c2C(=O)N(Cc2c(OCC)c2ncccc12)c1ccc(CS(=O)(=O)NC(=O)C2(CC2)c2ccccc2OC)cc1C