Reaction Details
TargetProstaglandin E2 receptor EP4 subtype
LigandBDBM50372062
Substrate/Competitorn/a
Meas. Tech.ChEMBL_464678 (CHEMBL934070)
Ki 0.36±n/a nM
Citation Burch, JDBelley, MFortin, RDeschênes, DGirard, MColucci, JFarand, JTherien, AGMathieu, MCDenis, DVigneault, ELévesque, JFGagné, SWrona, MXu, DClark, PRowland, SHan, Y Structure-activity relationships and pharmacokinetic parameters of quinoline acylsulfonamides as potent and selective antagonists of the EP(4) receptor. Bioorg Med Chem Lett18:2048-54 (2008) 
 
Prostaglandin E2 receptor EP4 subtype
Name:Prostaglandin E2 receptor EP4 subtype
Type:Enzyme
Mol. Mass.:53134.53
Organism:Homo sapiens (Human)
Description:P35408
Residue:488
BDBM50372062
NameBDBM50372062
Synonyms:CHEMBL272498
TypeSmall organic molecule
Emp. Form.C34H37N3O7S
Mol. Mass.631.738
SMILESCOc1ccccc1CC(=O)NS(=O)(=O)Cc1ccc(N2Cc3c(C2=O)c(OC(C)C)c2cccnc2c3OC(C)C)c(C)c1