Reaction Details
TargetProstaglandin E2 receptor EP4 subtype
LigandBDBM50372069
Substrate/Competitorn/a
Meas. Tech.ChEMBL_464678 (CHEMBL934070)
Ki 3.3±n/a nM
Citation Burch, JDBelley, MFortin, RDeschênes, DGirard, MColucci, JFarand, JTherien, AGMathieu, MCDenis, DVigneault, ELévesque, JFGagné, SWrona, MXu, DClark, PRowland, SHan, Y Structure-activity relationships and pharmacokinetic parameters of quinoline acylsulfonamides as potent and selective antagonists of the EP(4) receptor. Bioorg Med Chem Lett18:2048-54 (2008) 
 
Prostaglandin E2 receptor EP4 subtype
Name:Prostaglandin E2 receptor EP4 subtype
Type:Enzyme
Mol. Mass.:53134.53
Organism:Homo sapiens (Human)
Description:P35408
Residue:488
BDBM50372069
NameBDBM50372069
Synonyms:CHEMBL256005
TypeSmall organic molecule
Emp. Form.C31H31N3O6S
Mol. Mass.573.659
SMILESCCOc1c2CN(C(=O)c2c(OCC)c2ncccc12)c1ccc(CS(=O)(=O)NC(=O)Cc2ccccc2)cc1C