Reaction Details
TargetProstaglandin E2 receptor EP4 subtype
LigandBDBM50372064
Substrate/Competitorn/a
Meas. Tech.ChEMBL_464679 (CHEMBL934071)
Ki 2.3±n/a nM
Citation Burch, JDBelley, MFortin, RDeschênes, DGirard, MColucci, JFarand, JTherien, AGMathieu, MCDenis, DVigneault, ELévesque, JFGagné, SWrona, MXu, DClark, PRowland, SHan, Y Structure-activity relationships and pharmacokinetic parameters of quinoline acylsulfonamides as potent and selective antagonists of the EP(4) receptor. Bioorg Med Chem Lett18:2048-54 (2008) 
 
Prostaglandin E2 receptor EP4 subtype
Name:Prostaglandin E2 receptor EP4 subtype
Type:Enzyme
Mol. Mass.:53134.53
Organism:Homo sapiens (Human)
Description:P35408
Residue:488
BDBM50372064
NameBDBM50372064
Synonyms:CHEMBL256873
TypeSmall organic molecule
Emp. Form.C34H35N3O8S
Mol. Mass.645.722
SMILESCCOc1c2CN(C(=O)c2c(OCC)c2cccnc12)c1ccc(CS(=O)(=O)NC(=O)Cc2c(OC)cccc2C(C)=O)cc1C