Reaction Details
TargetAndrogen receptor
LigandBDBM50372086
Substrate/Competitorn/a
Meas. Tech.ChEMBL_464720 (CHEMBL933063)
Ki 4±n/a nM
Citation Salvati, MEBalog, AShan, WRampulla, RGiese, SMitt, TFurch, JAVite, GDAttar, RMJure-Kunkel, MGeng, JRizzo, CAGottardis, MMKrystek, SRGougoutas, JGalella, MAObermeier, MFura, AChandrasena, G Identification and optimization of a novel series of [2.2.1]-oxabicyclo imide-based androgen receptor antagonists. Bioorg Med Chem Lett18:1910-5 (2008) 
 
Androgen receptor
Name:Androgen receptor
Type:Receptor
Mol. Mass.:99185.27
Organism:Homo sapiens (Human)
Description:CHO cells were stably transfected with human AR gene.
Residue:920
BDBM50372086
NameBDBM50372086
Synonyms:CHEMBL403213
TypeSmall organic molecule
Emp. Form.C16H14ClN3O3
Mol. Mass.331.754
SMILESCC12CCC(C)(O1)c1c(O)n(c(O)c21)-c1cnc(C#N)c(Cl)c1