Reaction Details
TargetAndrogen receptor
LigandBDBM50372090
Substrate/Competitorn/a
Meas. Tech.ChEMBL_464720 (CHEMBL933063)
Ki 1±n/a nM
Citation Salvati, MEBalog, AShan, WRampulla, RGiese, SMitt, TFurch, JAVite, GDAttar, RMJure-Kunkel, MGeng, JRizzo, CAGottardis, MMKrystek, SRGougoutas, JGalella, MAObermeier, MFura, AChandrasena, G Identification and optimization of a novel series of [2.2.1]-oxabicyclo imide-based androgen receptor antagonists. Bioorg Med Chem Lett18:1910-5 (2008) 
 
Androgen receptor
Name:Androgen receptor
Type:Receptor
Mol. Mass.:99185.27
Organism:Homo sapiens (Human)
Description:CHO cells were stably transfected with human AR gene.
Residue:920
BDBM50372090
NameBDBM50372090
Synonyms:CHEMBL403668
TypeSmall organic molecule
Emp. Form.C17H15IN2O3
Mol. Mass.422.2171
SMILESCC12CCC(C)(O1)c1c(O)n(c(O)c21)-c1ccc(C#N)c(I)c1