Reaction Details
TargetVascular endothelial growth factor receptor 2
LigandBDBM50372150
Substrate/Competitorn/a
Meas. Tech.ChEMBL_464752 (CHEMBL930118)
IC50 1.1±n/a nM
Citation Dai, YHartandi, KSoni, NBPease, LJReuter, DROlson, AMOsterling, DJDoktor, SZAlbert, DHBouska, JJGlaser, KBMarcotte, PAStewart, KDDavidsen, SKMichaelides, MR Identification of aminopyrazolopyridine ureas as potent VEGFR/PDGFR multitargeted kinase inhibitors. Bioorg Med Chem Lett18:386-90 (2008) 
 
Vascular endothelial growth factor receptor 2
Name:Vascular endothelial growth factor receptor 2
Type:Receptor Tyrosine Kinase
Mol. Mass.:151510.97
Organism:Homo sapiens (Human)
Description:P35968
Residue:1356
BDBM50372150
NameBDBM50372150
Synonyms:CHEMBL255744
TypeSmall organic molecule
Emp. Form.C21H20N6O
Mol. Mass.372.4231
SMILESCc1cc(C)cc(NC(=O)Nc2ccc(cc2)-c2ccnc3[nH]nc(N)c23)c1