Reaction Details
TargetVascular endothelial growth factor receptor 2
LigandBDBM50372162
Substrate/Competitorn/a
Meas. Tech.ChEMBL_464751 (CHEMBL930117)
IC50 1.5±n/a nM
Citation Dai, YHartandi, KSoni, NBPease, LJReuter, DROlson, AMOsterling, DJDoktor, SZAlbert, DHBouska, JJGlaser, KBMarcotte, PAStewart, KDDavidsen, SKMichaelides, MR Identification of aminopyrazolopyridine ureas as potent VEGFR/PDGFR multitargeted kinase inhibitors. Bioorg Med Chem Lett18:386-90 (2008) 
 
Vascular endothelial growth factor receptor 2
Name:Vascular endothelial growth factor receptor 2
Type:Receptor Tyrosine Kinase
Mol. Mass.:151510.97
Organism:Homo sapiens (Human)
Description:P35968
Residue:1356
BDBM50372162
NameBDBM50372162
Synonyms:CHEMBL404366
TypeSmall organic molecule
Emp. Form.C20H17ClN6O
Mol. Mass.392.842
SMILESCn1nc(N)c2c(cncc12)-c1ccc(NC(=O)Nc2cccc(Cl)c2)cc1