Reaction Details
TargetVascular endothelial growth factor receptor 2
LigandBDBM50372143
Substrate/Competitorn/a
Meas. Tech.ChEMBL_464751 (CHEMBL930117)
IC50 1.2±n/a nM
Citation Dai, YHartandi, KSoni, NBPease, LJReuter, DROlson, AMOsterling, DJDoktor, SZAlbert, DHBouska, JJGlaser, KBMarcotte, PAStewart, KDDavidsen, SKMichaelides, MR Identification of aminopyrazolopyridine ureas as potent VEGFR/PDGFR multitargeted kinase inhibitors. Bioorg Med Chem Lett18:386-90 (2008) 
 
Vascular endothelial growth factor receptor 2
Name:Vascular endothelial growth factor receptor 2
Type:Receptor Tyrosine Kinase
Mol. Mass.:151510.97
Organism:Homo sapiens (Human)
Description:P35968
Residue:1356
BDBM50372143
NameBDBM50372143
Synonyms:CHEMBL404342
TypeSmall organic molecule
Emp. Form.C19H15ClN6O
Mol. Mass.378.815
SMILESNc1n[nH]c2cncc(-c3ccc(NC(=O)Nc4cccc(Cl)c4)cc3)c12