Reaction Details
TargetVascular endothelial growth factor receptor 2
LigandBDBM50372148
Substrate/Competitorn/a
Meas. Tech.ChEMBL_464751 (CHEMBL930117)
IC50 2.4±n/a nM
Citation Dai, YHartandi, KSoni, NBPease, LJReuter, DROlson, AMOsterling, DJDoktor, SZAlbert, DHBouska, JJGlaser, KBMarcotte, PAStewart, KDDavidsen, SKMichaelides, MR Identification of aminopyrazolopyridine ureas as potent VEGFR/PDGFR multitargeted kinase inhibitors. Bioorg Med Chem Lett18:386-90 (2008) 
 
Vascular endothelial growth factor receptor 2
Name:Vascular endothelial growth factor receptor 2
Type:Receptor Tyrosine Kinase
Mol. Mass.:151510.97
Organism:Homo sapiens (Human)
Description:P35968
Residue:1356
BDBM50372148
NameBDBM50372148
Synonyms:CHEMBL403402
TypeSmall organic molecule
Emp. Form.C20H14F4N6O
Mol. Mass.430.3584
SMILESNc1n[nH]c2nccc(-c3ccc(NC(=O)Nc4cc(ccc4F)C(F)(F)F)cc3)c12