Reaction Details
TargetBcl-2-like protein 2
LigandBDBM50372175
Substrate/Competitorn/a
Meas. Tech.ChEMBL_464768 (CHEMBL930134)
Ki 101000±n/a nM
Citation Wang, LKong, FKokoski, CLAndrews, DWXing, C Development of dimeric modulators for anti-apoptotic Bcl-2 proteins. Bioorg Med Chem Lett18:236-40 (2008) 
 
Bcl-2-like protein 2
Name:Bcl-2-like protein 2
Type:Protein
Mol. Mass.:20742.61
Organism:Homo sapiens (Human)
Description:n/a
Residue:193
BDBM50372175
NameBDBM50372175
Synonyms:CHEMBL272110
TypeSmall organic molecule
Emp. Form.C40H30Br2N2O6S4
Mol. Mass.922.744
SMILESBrc1ccc(\C=C2/SC(=S)N([C@@H](Cc3ccccc3)C(=O)OCCOC(=O)[C@H](Cc3ccccc3)N3C(=S)S\C(=C/c4ccc(Br)cc4)C3=O)C2=O)cc1