Reaction Details
TargetBeta-secretase 1
LigandBDBM50372185
Substrate/Competitorn/a
Meas. Tech.ChEMBL_464799 (CHEMBL946838)
IC50 26±n/a nM
Citation Iserloh, UWu, YCumming, JNPan, JWang, LYStamford, AWKennedy, MEKuvelkar, RChen, XParker, EMStrickland, CVoigt, J Potent pyrrolidine- and piperidine-based BACE-1 inhibitors. Bioorg Med Chem Lett18:414-7 (2008) 
 
Beta-secretase 1
Name:Beta-secretase 1
Type:Protein
Mol. Mass.:55755.10
Organism:Homo sapiens (Human)
Description:P56817
Residue:501
BDBM50372185
NameBDBM50372185
Synonyms:CHEMBL256372
TypeSmall organic molecule
Emp. Form.C33H48F2N4O4
Mol. Mass.602.7554
SMILESCCCN(CCC)C(=O)c1cc(C)cc(c1)C(=O)N[C@@H](Cc1cc(F)cc(F)c1)[C@H](O)[C@H]1C[C@H](CCN1)OCCN(C)C