Reaction Details
TargetBeta-secretase 1
LigandBDBM50372266
Substrate/Competitorn/a
Meas. Tech.ChEMBL_464832 (CHEMBL930550)
IC50 130±n/a nM
Citation Jennings, LDCole, DCStock, JRSukhdeo, MNEllingboe, JWCowling, RJin, GManas, ESFan, KYMalamas, MSHarrison, BLJacobsen, SChopra, RLohse, PAMoore, WJO'Donnell, MMHu, YRobichaud, AJTurner, MJWagner, EBard, J Acylguanidine inhibitors of beta-secretase: optimization of the pyrrole ring substituents extending into the S1' substrate binding pocket. Bioorg Med Chem Lett18:767-71 (2008) 
 
Beta-secretase 1
Name:Beta-secretase 1
Type:Protein
Mol. Mass.:55755.10
Organism:Homo sapiens (Human)
Description:P56817
Residue:501
BDBM50372266
NameBDBM50372266
Synonyms:CHEMBL273186
TypeSmall organic molecule
Emp. Form.C26H29ClN4O4
Mol. Mass.496.986
SMILESCCCOc1ccc(cc1)-c1ccc(-c2ccccc2Cl)n1CC(=O)NC(=N)NCCCC(O)=O