Reaction Details
TargetHistamine H3 receptor
LigandBDBM50372310
Substrate/Competitorn/a
Meas. Tech.ChEMBL_464863 (CHEMBL930580)
Ki 150±n/a nM
Citation Nersesian, DLBlack, LAMiller, TRVortherms, TAEsbenshade, TAHancock, AACowart, MD In vitro SAR of pyrrolidine-containing histamine H3 receptor antagonists: trends across multiple chemical series. Bioorg Med Chem Lett18:355-9 (2008) 
 
Histamine H3 receptor
Name:Histamine H3 receptor
Type:G Protein-Coupled Receptor (GPCR)
Mol. Mass.:48607.98
Organism:Rattus norvegicus (rat)
Description:n/a
Residue:445
BDBM50372310
NameBDBM50372310
Synonyms:CHEMBL408259
TypeSmall organic molecule
Emp. Form.C14H22N2
Mol. Mass.218.3379
SMILESCCc1ccc(CCN2CCC[C@H]2C)nc1