Reaction Details
TargetHistamine H4 receptor
LigandBDBM50372296
Substrate/Competitorn/a
Meas. Tech.ChEMBL_464868 (CHEMBL931758)
Ki>1000±n/a nM
Citation Nersesian, DLBlack, LAMiller, TRVortherms, TAEsbenshade, TAHancock, AACowart, MD In vitro SAR of pyrrolidine-containing histamine H3 receptor antagonists: trends across multiple chemical series. Bioorg Med Chem Lett18:355-9 (2008) 
 
Histamine H4 receptor
Name:Histamine H4 receptor
Type:G Protein-Coupled Receptor (GPCR)
Mol. Mass.:44517.02
Organism:Homo sapiens (Human)
Description:Binding assays were using CHO cells stably expressing hH4R receptors.
Residue:390
BDBM50372296
NameBDBM50372296
Synonyms:CHEMBL402377
TypeSmall organic molecule
Emp. Form.C17H21N
Mol. Mass.239.3553
SMILESC[C@H]1CCCN1CCc1ccc2ccccc2c1