Reaction Details
TargetHistamine H1 receptor
LigandBDBM50372296
Substrate/Competitorn/a
Meas. Tech.ChEMBL_464866 (CHEMBL931756)
Ki>1000±n/a nM
Citation Nersesian, DLBlack, LAMiller, TRVortherms, TAEsbenshade, TAHancock, AACowart, MD In vitro SAR of pyrrolidine-containing histamine H3 receptor antagonists: trends across multiple chemical series. Bioorg Med Chem Lett18:355-9 (2008) 
 
Histamine H1 receptor
Name:Histamine H1 receptor
Type:G Protein-Coupled Receptor (GPCR)
Mol. Mass.:55808.72
Organism:Homo sapiens (Human)
Description:Cell pellets from SK-N-MC cells transfected with human H1 receptor were used in binding assay.
Residue:487
BDBM50372296
NameBDBM50372296
Synonyms:CHEMBL402377
TypeSmall organic molecule
Emp. Form.C17H21N
Mol. Mass.239.3553
SMILESC[C@H]1CCCN1CCc1ccc2ccccc2c1