Reaction Details
TargetHistamine H2 receptor
LigandBDBM50372296
Substrate/Competitorn/a
Meas. Tech.ChEMBL_464867 (CHEMBL931757)
Ki>1000±n/a nM
Citation Nersesian, DLBlack, LAMiller, TRVortherms, TAEsbenshade, TAHancock, AACowart, MD In vitro SAR of pyrrolidine-containing histamine H3 receptor antagonists: trends across multiple chemical series. Bioorg Med Chem Lett18:355-9 (2008) 
 
Histamine H2 receptor
Name:Histamine H2 receptor
Type:G Protein-Coupled Receptor (GPCR)
Mol. Mass.:40115.31
Organism:Homo sapiens (Human)
Description:n/a
Residue:359
BDBM50372296
NameBDBM50372296
Synonyms:CHEMBL402377
TypeSmall organic molecule
Emp. Form.C17H21N
Mol. Mass.239.3553
SMILESC[C@H]1CCCN1CCc1ccc2ccccc2c1