Reaction Details
TargetFatty-acid amide hydrolase 1 [30-579]
LigandBDBM50372359
Substrate/Competitorn/a
Meas. Tech.ChEMBL_464889 (CHEMBL949088)
Ki 1.6±n/a nM
Citation Kimball, FSRomero, FAEzzili, CGarfunkle, JRayl, TJHochstatter, DGHwang, IBoger, DL Optimization of alpha-ketooxazole inhibitors of fatty acid amide hydrolase. J Med Chem51:937-47 (2008) 
 
Fatty-acid amide hydrolase 1 [30-579]
Name:Fatty-acid amide hydrolase 1 [30-579]
Type:Single-pass membrane protein; homodimer
Mol. Mass.:60474.00
Organism:Rattus norvegicus (rat)
Description:P97612 (aa 30-579)
Residue:550
BDBM50372359
NameBDBM50372359
Synonyms:CHEMBL271390
TypeSmall organic molecule
Emp. Form.C21H19NO5
Mol. Mass.365.3793
SMILESCOC(=O)c1cnc(o1)C(=O)CCc1ccc(COc2ccccc2)cc1