Reaction Details
TargetNeutral cholesterol ester hydrolase 1
LigandBDBM23078
Substrate/Competitorn/a
Meas. Tech.ChEMBL_464892 (CHEMBL949091)
IC50>100000±n/a nM
Citation Kimball, FSRomero, FAEzzili, CGarfunkle, JRayl, TJHochstatter, DGHwang, IBoger, DL Optimization of alpha-ketooxazole inhibitors of fatty acid amide hydrolase. J Med Chem51:937-47 (2008) 
 
Neutral cholesterol ester hydrolase 1
Name:Neutral cholesterol ester hydrolase 1
Type:PROTEIN
Mol. Mass.:45810.81
Organism:Homo sapiens (Human)
Description:ChEMBL_835312
Residue:408
BDBM23078
NameBDBM23078
Synonyms:3-(4-phenylphenyl)-1-[5-(pyridin-2-yl)-1,3-oxazol-2-yl]propan-1-one alpha-ketooxazole, 11j
TypeSmall organic molecule
Emp. Form.C23H18N2O2
Mol. Mass.354.4012
SMILESO=C(CCc1ccc(cc1)-c1ccccc1)c1ncc(o1)-c1ccccn1