Reaction Details
TargetFatty-acid amide hydrolase 1 [30-579]
LigandBDBM50372383
Substrate/Competitorn/a
Meas. Tech.ChEMBL_464889 (CHEMBL949088)
Ki 1.2±n/a nM
Citation Kimball, FSRomero, FAEzzili, CGarfunkle, JRayl, TJHochstatter, DGHwang, IBoger, DL Optimization of alpha-ketooxazole inhibitors of fatty acid amide hydrolase. J Med Chem51:937-47 (2008) 
 
Fatty-acid amide hydrolase 1 [30-579]
Name:Fatty-acid amide hydrolase 1 [30-579]
Type:Single-pass membrane protein; homodimer
Mol. Mass.:60474.00
Organism:Rattus norvegicus (rat)
Description:P97612 (aa 30-579)
Residue:550
BDBM50372383
NameBDBM50372383
Synonyms:CHEMBL272462
TypeSmall organic molecule
Emp. Form.C24H19N3O3
Mol. Mass.397.426
SMILESNC(=O)c1cccc(n1)-c1cnc(o1)C(=O)CCc1ccc(cc1)-c1ccccc1