Reaction Details
TargetFatty-acid amide hydrolase 1 [30-579]
LigandBDBM50372372
Substrate/Competitorn/a
Meas. Tech.ChEMBL_464889 (CHEMBL949088)
Ki 0.8±n/a nM
Citation Kimball, FSRomero, FAEzzili, CGarfunkle, JRayl, TJHochstatter, DGHwang, IBoger, DL Optimization of alpha-ketooxazole inhibitors of fatty acid amide hydrolase. J Med Chem51:937-47 (2008) 
 
Fatty-acid amide hydrolase 1 [30-579]
Name:Fatty-acid amide hydrolase 1 [30-579]
Type:Single-pass membrane protein; homodimer
Mol. Mass.:60474.00
Organism:Rattus norvegicus (rat)
Description:P97612 (aa 30-579)
Residue:550
BDBM50372372
NameBDBM50372372
Synonyms:CHEMBL272038
TypeSmall organic molecule
Emp. Form.C19H14N2O3
Mol. Mass.318.3261
SMILESO=C(CCc1ccc(Oc2ccccc2)cc1)c1ncc(o1)C#N