Reaction Details
TargetNeutral cholesterol ester hydrolase 1
LigandBDBM23120
Substrate/Competitorn/a
Meas. Tech.ChEMBL_464892 (CHEMBL949091)
IC50>100000±n/a nM
Citation Kimball, FSRomero, FAEzzili, CGarfunkle, JRayl, TJHochstatter, DGHwang, IBoger, DL Optimization of alpha-ketooxazole inhibitors of fatty acid amide hydrolase. J Med Chem51:937-47 (2008) 
 
Neutral cholesterol ester hydrolase 1
Name:Neutral cholesterol ester hydrolase 1
Type:PROTEIN
Mol. Mass.:45810.81
Organism:Homo sapiens (Human)
Description:ChEMBL_835312
Residue:408
BDBM23120
NameBDBM23120
Synonyms:7-phenyl-1-[5-(pyridin-2-yl)-1,3-oxazol-2-yl]heptan-1-one OL-135
TypeSmall organic molecule
Emp. Form.C21H22N2O2
Mol. Mass.334.4116
SMILESO=C(CCCCCCc1ccccc1)c1ncc(o1)-c1ccccn1