Reaction Details
TargetHistone deacetylase 1
LigandBDBM50216032
Substrate/Competitorn/a
Meas. Tech.ChEMBL_464922 (CHEMBL946979)
IC50 31±n/a nM
Citation Paris, MPorcelloni, MBinaschi, MFattori, D Histone deacetylase inhibitors: from bench to clinic. J Med Chem51:1505-29 (2008) 
 
Histone deacetylase 1
Name:Histone deacetylase 1
Type:Enzyme
Mol. Mass.:55090.27
Organism:Homo sapiens (Human)
Description:Q13547
Residue:482
BDBM50216032
NameBDBM50216032
Synonyms:CHEMBL247184 | N-hydroxy-5-(2-phenylacetamido)benzo[b]thiophene-2-carboxamide
TypeSmall organic molecule
Emp. Form.C17H14N2O3S
Mol. Mass.326.37
SMILESONC(=O)c1cc2cc(NC(=O)Cc3ccccc3)ccc2s1