Reaction Details
TargetHistone deacetylase 8
LigandBDBM50372437
Substrate/Competitorn/a
Meas. Tech.ChEMBL_464936 (CHEMBL946993)
IC50>10000±n/a nM
Citation Paris, MPorcelloni, MBinaschi, MFattori, D Histone deacetylase inhibitors: from bench to clinic. J Med Chem51:1505-29 (2008) 
 
Histone deacetylase 8
Name:Histone deacetylase 8
Type:Enzyme
Mol. Mass.:41749.60
Organism:Homo sapiens (Human)
Description:Q9BY41
Residue:377
BDBM50372437
NameBDBM50372437
Synonyms:CHEMBL552879
TypeSmall organic molecule
Emp. Form.C14H20N2O2S
Mol. Mass.280.386
SMILESONC(=S)CCCCCCC(=O)Nc1ccccc1