Reaction Details
TargetHistone deacetylase 1
LigandBDBM50372443
Substrate/Competitorn/a
Meas. Tech.ChEMBL_464918 (CHEMBL946975)
IC50 1000±n/a nM
Citation Paris, MPorcelloni, MBinaschi, MFattori, D Histone deacetylase inhibitors: from bench to clinic. J Med Chem51:1505-29 (2008) 
 
Histone deacetylase 1
Name:Histone deacetylase 1
Type:Enzyme
Mol. Mass.:55090.27
Organism:Homo sapiens (Human)
Description:Q13547
Residue:482
BDBM50372443
NameBDBM50372443
Synonyms:CHEMBL270097
TypeSmall organic molecule
Emp. Form.C26H24N4O2
Mol. Mass.424.4944
SMILESNc1ccccc1NC(=O)c1ccc(\C=C\C(=O)NCCc2c[nH]c3ccccc23)cc1