Reaction Details
TargetHistone deacetylase 1
LigandBDBM50232655
Substrate/Competitorn/a
Meas. Tech.ChEMBL_464918 (CHEMBL946975)
IC50 300±n/a nM
Citation Paris, MPorcelloni, MBinaschi, MFattori, D Histone deacetylase inhibitors: from bench to clinic. J Med Chem51:1505-29 (2008) 
 
Histone deacetylase 1
Name:Histone deacetylase 1
Type:Enzyme
Mol. Mass.:55090.27
Organism:Homo sapiens (Human)
Description:Q13547
Residue:482
BDBM50232655
NameBDBM50232655
Synonyms:4-((1H-benzo[d]imidazol-2-ylthio)methyl)-N-(2-aminophenyl)benzamide | CHEMBL254110
TypeSmall organic molecule
Emp. Form.C21H18N4OS
Mol. Mass.374.459
SMILESNc1ccccc1NC(=O)c1ccc(CSc2nc3ccccc3[nH]2)cc1