Reaction Details
TargetHistone deacetylase 1
LigandBDBM50187085
Substrate/Competitorn/a
Meas. Tech.ChEMBL_464918 (CHEMBL946975)
IC50 4000±n/a nM
Citation Paris, MPorcelloni, MBinaschi, MFattori, D Histone deacetylase inhibitors: from bench to clinic. J Med Chem51:1505-29 (2008) 
 
Histone deacetylase 1
Name:Histone deacetylase 1
Type:Enzyme
Mol. Mass.:55090.27
Organism:Homo sapiens (Human)
Description:Q13547
Residue:482
BDBM50187085
NameBDBM50187085
Synonyms:6-(4-methoxybenzylamino)-N-(2-aminophenyl)nicotinamide | CHEMBL209729
TypeSmall organic molecule
Emp. Form.C20H20N4O2
Mol. Mass.348.3984
SMILESCOc1ccc(CNc2ccc(cn2)C(=O)Nc2ccccc2N)cc1