Reaction Details
TargetHistone deacetylase 1
LigandBDBM50187105
Substrate/Competitorn/a
Meas. Tech.ChEMBL_464918 (CHEMBL946975)
IC50 4000±n/a nM
Citation Paris, MPorcelloni, MBinaschi, MFattori, D Histone deacetylase inhibitors: from bench to clinic. J Med Chem51:1505-29 (2008) 
 
Histone deacetylase 1
Name:Histone deacetylase 1
Type:Enzyme
Mol. Mass.:55090.27
Organism:Homo sapiens (Human)
Description:Q13547
Residue:482
BDBM50187105
NameBDBM50187105
Synonyms:(E)-3-(4-(4-methoxybenzylamino)phenyl)-N-(2-aminophenyl)acrylamide CHEMBL211320
TypeSmall organic molecule
Emp. Form.C23H23N3O2
Mol. Mass.373.4476
SMILESCOc1ccc(CNc2ccc(\C=C\C(=O)Nc3ccccc3N)cc2)cc1