Reaction Details
TargetHistone deacetylase 1
LigandBDBM50372449
Substrate/Competitorn/a
Meas. Tech.ChEMBL_464922 (CHEMBL946979)
IC50 26.5±n/a nM
Citation Paris, MPorcelloni, MBinaschi, MFattori, D Histone deacetylase inhibitors: from bench to clinic. J Med Chem51:1505-29 (2008) 
 
Histone deacetylase 1
Name:Histone deacetylase 1
Type:Enzyme
Mol. Mass.:55090.27
Organism:Homo sapiens (Human)
Description:Q13547
Residue:482
BDBM50372449
NameBDBM50372449
Synonyms:CHEMBL406650
TypeSmall organic molecule
Emp. Form.C29H30N6O5
Mol. Mass.542.5857
SMILESONC(=O)CCCCCC(=O)N(CC(=O)Nc1cccc2cccnc12)CC(=O)Nc1cccc2cccnc12