Reaction Details
TargetHistone deacetylase 8
LigandBDBM50372458
Substrate/Competitorn/a
Meas. Tech.ChEMBL_464936 (CHEMBL946993)
IC50>40000±n/a nM
Citation Paris, MPorcelloni, MBinaschi, MFattori, D Histone deacetylase inhibitors: from bench to clinic. J Med Chem51:1505-29 (2008) 
 
Histone deacetylase 8
Name:Histone deacetylase 8
Type:Enzyme
Mol. Mass.:41749.60
Organism:Homo sapiens (Human)
Description:Q9BY41
Residue:377
BDBM50372458
NameBDBM50372458
Synonyms:CHEMBL272612
TypeSmall organic molecule
Emp. Form.C16H23NO2S
Mol. Mass.293.424
SMILESCSCC(=O)CCCCCCC(=O)Nc1ccccc1