Reaction Details
TargetHistone deacetylase 1
LigandBDBM50372463
Substrate/Competitorn/a
Meas. Tech.ChEMBL_464922 (CHEMBL946979)
IC50 79±n/a nM
Citation Paris, MPorcelloni, MBinaschi, MFattori, D Histone deacetylase inhibitors: from bench to clinic. J Med Chem51:1505-29 (2008) 
 
Histone deacetylase 1
Name:Histone deacetylase 1
Type:Enzyme
Mol. Mass.:55090.27
Organism:Homo sapiens (Human)
Description:Q13547
Residue:482
BDBM50372463
NameBDBM50372463
Synonyms:CHEMBL272402
TypeSmall organic molecule
Emp. Form.C27H37N3O2
Mol. Mass.435.6016
SMILESCN1CCCCC1N[C@@H](CCCCCC(C)=O)C(=O)Nc1cccc(c1)-c1ccccc1