Reaction Details
TargetHistone deacetylase 1
LigandBDBM50372464
Substrate/Competitorn/a
Meas. Tech.ChEMBL_464922 (CHEMBL946979)
IC50 25±n/a nM
Citation Paris, MPorcelloni, MBinaschi, MFattori, D Histone deacetylase inhibitors: from bench to clinic. J Med Chem51:1505-29 (2008) 
 
Histone deacetylase 1
Name:Histone deacetylase 1
Type:Enzyme
Mol. Mass.:55090.27
Organism:Homo sapiens (Human)
Description:Q13547
Residue:482
BDBM50372464
NameBDBM50372464
Synonyms:CHEMBL271798
TypeSmall organic molecule
Emp. Form.C29H34N4O3S
Mol. Mass.518.67
SMILESCOc1ccc2[nH]c(C)c(CN[C@@H](CCCCCC(C)=O)C(=O)Nc3nc(cs3)-c3ccccc3)c2c1