Reaction Details
TargetHistone deacetylase 1
LigandBDBM50195110
Substrate/Competitorn/a
Meas. Tech.ChEMBL_464922 (CHEMBL946979)
IC50 930±n/a nM
Citation Paris, MPorcelloni, MBinaschi, MFattori, D Histone deacetylase inhibitors: from bench to clinic. J Med Chem51:1505-29 (2008) 
 
Histone deacetylase 1
Name:Histone deacetylase 1
Type:Enzyme
Mol. Mass.:55090.27
Organism:Homo sapiens (Human)
Description:Q13547
Residue:482
BDBM50195110
NameBDBM50195110
Synonyms:(S)-2-acetamido-8-oxo-N-(2-(2-phenyl-1H-indol-3-yl)ethyl)nonanamide | CHEMBL216336
TypeSmall organic molecule
Emp. Form.C27H33N3O3
Mol. Mass.447.5692
SMILESCC(=O)CCCCC[C@H](NC(C)=O)C(=O)NCCc1c([nH]c2ccccc12)-c1ccccc1