Reaction Details
TargetHistone deacetylase 6
LigandBDBM50372446
Substrate/Competitorn/a
Meas. Tech.ChEMBL_464925 (CHEMBL946982)
IC50 13±n/a nM
Citation Paris, MPorcelloni, MBinaschi, MFattori, D Histone deacetylase inhibitors: from bench to clinic. J Med Chem51:1505-29 (2008) 
 
Histone deacetylase 6
Name:Histone deacetylase 6
Type:Chromatin regulator; hydrolase; repressor
Mol. Mass.:131381.51
Organism:Homo sapiens (Human)
Description:Q9UBN7
Residue:1215
BDBM50372446
NameBDBM50372446
Synonyms:CHEMBL272401
TypeSmall organic molecule
Emp. Form.C24H34N4O2S
Mol. Mass.442.617
SMILESCN1CCCCC1N[C@@H](CCCCCC(C)=O)C(=O)Nc1nc(cs1)-c1ccccc1