Reaction Details
TargetHistone deacetylase 8
LigandBDBM50372468
Substrate/Competitorn/a
Meas. Tech.ChEMBL_464919 (CHEMBL946976)
IC50 500±n/a nM
Citation Paris, MPorcelloni, MBinaschi, MFattori, D Histone deacetylase inhibitors: from bench to clinic. J Med Chem51:1505-29 (2008) 
 
Histone deacetylase 8
Name:Histone deacetylase 8
Type:Enzyme
Mol. Mass.:41749.60
Organism:Homo sapiens (Human)
Description:Q9BY41
Residue:377
BDBM50372468
NameBDBM50372468
Synonyms:CHEMBL406800 | SB-379278A
TypeSmall organic molecule
Emp. Form.C8H7N3S
Mol. Mass.177.226
SMILESS=c1[nH]cc([nH]1)-c1ccncc1