Reaction Details
TargetHistone deacetylase 1
LigandBDBM50372469
Substrate/Competitorn/a
Meas. Tech.ChEMBL_464918 (CHEMBL946975)
IC50 50±n/a nM
Citation Paris, MPorcelloni, MBinaschi, MFattori, D Histone deacetylase inhibitors: from bench to clinic. J Med Chem51:1505-29 (2008) 
 
Histone deacetylase 1
Name:Histone deacetylase 1
Type:Enzyme
Mol. Mass.:55090.27
Organism:Homo sapiens (Human)
Description:Q13547
Residue:482
BDBM50372469
NameBDBM50372469
Synonyms:AZUMAMIDE E
TypeSmall organic molecule
Emp. Form.C27H38N4O6
Mol. Mass.514.6138
SMILESCC(C)[C@H]1NC(=O)[C@@H](C)[C@@H](CC=CCCC(O)=O)NC(=O)[C@@H](Cc2ccccc2)NC(=O)[C@@H](C)NC1=O