Reaction Details
TargetSubstance-P receptor
LigandBDBM50372480
Substrate/Competitorn/a
Meas. Tech.ChEMBL_465010 (CHEMBL929512)
IC50 0.06±n/a nM
Citation Morriello, GJDevita, RJMills, SGYoung, JRLin, PDoss, GChicchi, GGDemartino, JKurtz, MMTsao, KLCarlson, ETownson, KWheeldon, ABoyce, SCollinson, NRupniak, NMoore, S Fused bicyclic pyrrolizinones as new scaffolds for human NK1 antagonists. Bioorg Med Chem16:2156-70 (2008) 
 
Substance-P receptor
Name:Substance-P receptor
Type:G Protein-Coupled Receptor (GPCR)
Mol. Mass.:46254.43
Organism:Homo sapiens (Human)
Description:P25103
Residue:407
BDBM50372480
NameBDBM50372480
Synonyms:CHEMBL270090
TypeSmall organic molecule
Emp. Form.C22H19F7N2O2
Mol. Mass.476.3873
SMILESC[C@@H](O[C@H]1CN2[C@@H](CNC2=O)[C@@H]1c1ccc(F)cc1)c1cc(cc(c1)C(F)(F)F)C(F)(F)F