Reaction Details
TargetSubstance-P receptor
LigandBDBM50372483
Substrate/Competitorn/a
Meas. Tech.ChEMBL_465010 (CHEMBL929512)
IC50 0.33±n/a nM
Citation Morriello, GJDevita, RJMills, SGYoung, JRLin, PDoss, GChicchi, GGDemartino, JKurtz, MMTsao, KLCarlson, ETownson, KWheeldon, ABoyce, SCollinson, NRupniak, NMoore, S Fused bicyclic pyrrolizinones as new scaffolds for human NK1 antagonists. Bioorg Med Chem16:2156-70 (2008) 
 
Substance-P receptor
Name:Substance-P receptor
Type:G Protein-Coupled Receptor (GPCR)
Mol. Mass.:46254.43
Organism:Homo sapiens (Human)
Description:P25103
Residue:407
BDBM50372483
NameBDBM50372483
Synonyms:CHEMBL272469
TypeSmall organic molecule
Emp. Form.C22H18F7NO3
Mol. Mass.477.372
SMILESC[C@@H](O[C@H]1[C@@H]2COC(=O)N2C[C@@H]1c1ccc(F)cc1)c1cc(cc(c1)C(F)(F)F)C(F)(F)F