Reaction Details
TargetTranscription factor p65
LigandBDBM50372493
Substrate/Competitorn/a
Meas. Tech.ChEMBL_465172 (CHEMBL945842)
IC50 1000±n/a nM
Citation Xie, YDeng, SThomas, CJLiu, YZhang, YQRinderspacher, AHuang, WGong, GWyler, MCayanis, EAulner, NTöbben, UChung, CPampou, SSouthall, NVidovic, DSchürer, SBranden, LDavis, REStaudt, LMInglese, JAustin, CPLandry, DWSmith, DHAuld, DS Identification of N-(quinolin-8-yl)benzenesulfonamides as agents capable of down-regulating NFkappaB activity within two separate high-throughput screens of NFkappaB activation. Bioorg Med Chem Lett18:329-35 (2008) 
 
Transcription factor p65
Name:Transcription factor p65
Type:Enzyme
Mol. Mass.:60211.92
Organism:Homo sapiens (Human)
Description:Q04206
Residue:551
BDBM50372493
NameBDBM50372493
Synonyms:CHEMBL404128
TypeSmall organic molecule
Emp. Form.C16H12N2O3S
Mol. Mass.312.343
SMILESCOc1ccc2c(c1)-c1ccc3cccnc3c1NS2(=O)=O