Reaction Details
TargetAdenosine receptor A2a
LigandBDBM50372564
Substrate/Competitorn/a
Meas. Tech.ChEMBL_465258 (CHEMBL930529)
Ki 5±n/a nM
Citation Moorjani, MZhang, XChen, YLin, ERueter, JKGross, RSLanier, MCTellew, JEWilliams, JPLechner, SMMalany, SSantos, MEkhlassi, PCastro-Palomino, JCCrespo, MIPrat, MGual, SDíaz, JLSaunders, JSlee, DH 2,6-Diaryl-4-phenacylaminopyrimidines as potent and selective adenosine A(2A) antagonists with reduced hERG liability. Bioorg Med Chem Lett18:1269-73 (2008) 
 
Adenosine receptor A2a
Name:Adenosine receptor A2a
Type:G Protein-Coupled Receptor (GPCR)
Mol. Mass.:44716.46
Organism:Homo sapiens (Human)
Description:P29274
Residue:412
BDBM50372564
NameBDBM50372564
Synonyms:CHEMBL257417
TypeSmall organic molecule
Emp. Form.C23H24N6O4S
Mol. Mass.480.539
SMILESCc1cc(C)n(n1)-c1cc(NC(=O)Cc2ccc(NS(C)(=O)=O)cc2)nc(n1)-c1ccc(C)o1