Reaction Details
TargetIntegrin alpha-V/beta-5
LigandBDBM50370689
Substrate/Competitorn/a
Meas. Tech.ChEMBL_465289 (CHEMBL933854)
IC50 0.9±n/a nM
Citation Zanardi, FBurreddu, PRassu, GAuzzas, LBattistini, LCurti, CSartori, ANicastro, GMenchi, GCini, NBottoncetti, ABottonocetti, ARaspanti, SCasiraghi, G Discovery of subnanomolar arginine-glycine-aspartate-based alphaVbeta3/alphaVbeta5 integrin binders embedding 4-aminoproline residues. J Med Chem51:1771-82 (2008) 
 
Integrin alpha-V/beta-5
Name:Integrin alpha-V/beta-5
Type:Enzyme
Mol. Mass.:n/a
Description:n/a
Components:This complex has 2 components.
Component 1
Name:Integrin alpha-V
Synonyms:ITAV_HUMAN Integrin alpha-V/alpha-5 VNRA Vitronectin receptor | Vitronectin receptor subunit alpha
Type:PROTEIN
Mol. Mass.:116024.92
Organism:Homo sapiens (Human)
Description:ChEMBL_582336
Residue:1048
Component 2
Name:Integrin beta-5
Synonyms:ITB5_HUMAN | ITGB5
Type:PROTEIN
Mol. Mass.:88047.37
Organism:Homo sapiens (Human)
Description:EBI_10915
Residue:799
BDBM50370689
NameBDBM50370689
Synonyms:CHEMBL392303 | ST-1646
TypeSmall organic molecule
Emp. Form.C21H33N7O6
Mol. Mass.479.53
SMILES[#7]\[#6](-[#7])=[#7]\[#6]-[#6]-[#6]-[#6@@H]-1-[#7]-[#6](=O)-[#6]-[#7]-[#6](=O)-[#6@@H](-[#6]-[#6](-[#8])=O)-[#7]-[#6@H]-2-[#6]-[#6]-[#6]-[#6@H]-3-[#6]-[#6]-[#6@@H](-[#7]-3-[#6]-2=O)-[#6]-1=O